OpenWrt/LEDE Project

  • Status Closed
  • Percent Complete
    100%
  • Task Type Bug Report
  • Category Packages
  • Assigned To No-one
  • Operating System All
  • Severity Critical
  • Priority Very Low
  • Reported Version Trunk
  • Due in Version Undecided
  • Due Date Undecided
  • Votes
  • Private
Attached to Project: OpenWrt/LEDE Project
Opened by build000 - 05.02.2018
Last edited by Hans Dedecker - 24.02.2018

FS#1332 - error build/compile samba-* (r6007-e7469d5)

@nbd168
version: r6007-e7469d5
machine: MQ-Maker WITI (mt7621)

make -j1 V=s:

(...)
make[3]: Entering directory '/home/sj/Pulpit/Projekty/WITI-TRUNK/package/network/services/samba36'
rm -f /home/sj/Pulpit/Projekty/WITI-TRUNK/build_dir/target-mipsel_24kc_musl/samba-3.6.25/.built
touch /home/sj/Pulpit/Projekty/WITI-TRUNK/build_dir/target-mipsel_24kc_musl/samba-3.6.25/.built_check
CFLAGS="-Os -pipe -mno-branch-likely -mips32r2 -mtune=24kc -fno-caller-saves -fno-plt -fhonour-copts -Wno-error=unused-but-set-variable -Wno-error=unused-result -msoft-float -mips16 -minterlink-mips16 -iremap/home/sj/Pulpit/Projekty/WITI-TRUNK/build_dir/target-mipsel_24kc_musl/samba-3.6.25:samba-3.6.25 -Wformat -Werror=format-security -fstack-protector -D_FORTIFY_SOURCE=1 -Wl,-z,now -Wl,-z,relro -DMAX_DEBUG_LEVEL=-1 -D__location__=\\\"\\\" -ffunction-sections -fdata-sections  -I/home/sj/Pulpit/Projekty/WITI-TRUNK/staging_dir/target-mipsel_24kc_musl/usr/include -I/home/sj/Pulpit/Projekty/WITI-TRUNK/staging_dir/target-mipsel_24kc_musl/include -I/home/sj/Pulpit/Projekty/WITI-TRUNK/staging_dir/toolchain-mipsel_24kc_gcc-5.5.0_musl/usr/include -I/home/sj/Pulpit/Projekty/WITI-TRUNK/staging_dir/toolchain-mipsel_24kc_gcc-5.5.0_musl/include/fortify -I/home/sj/Pulpit/Projekty/WITI-TRUNK/staging_dir/toolchain-mipsel_24kc_gcc-5.5.0_musl/include " CXXFLAGS="-Os -pipe -mno-branch-likely -mips32r2 -mtune=24kc -fno-caller-saves -fno-plt -fhonour-copts -Wno-error=unused-but-set-variable -Wno-error=unused-result -msoft-float -mips16 -minterlink-mips16 -iremap/home/sj/Pulpit/Projekty/WITI-TRUNK/build_dir/target-mipsel_24kc_musl/samba-3.6.25:samba-3.6.25 -Wformat -Werror=format-security -fstack-protector -D_FORTIFY_SOURCE=1 -Wl,-z,now -Wl,-z,relro -DMAX_DEBUG_LEVEL=-1 -D__location__=\\\"\\\" -ffunction-sections -fdata-sections  -I/home/sj/Pulpit/Projekty/WITI-TRUNK/staging_dir/target-mipsel_24kc_musl/usr/include -I/home/sj/Pulpit/Projekty/WITI-TRUNK/staging_dir/target-mipsel_24kc_musl/include -I/home/sj/Pulpit/Projekty/WITI-TRUNK/staging_dir/toolchain-mipsel_24kc_gcc-5.5.0_musl/usr/include -I/home/sj/Pulpit/Projekty/WITI-TRUNK/staging_dir/toolchain-mipsel_24kc_gcc-5.5.0_musl/include/fortify -I/home/sj/Pulpit/Projekty/WITI-TRUNK/staging_dir/toolchain-mipsel_24kc_gcc-5.5.0_musl/include " LDFLAGS="-L/home/sj/Pulpit/Projekty/WITI-TRUNK/staging_dir/target-mipsel_24kc_musl/usr/lib -L/home/sj/Pulpit/Projekty/WITI-TRUNK/staging_dir/target-mipsel_24kc_musl/lib -L/home/sj/Pulpit/Projekty/WITI-TRUNK/staging_dir/toolchain-mipsel_24kc_gcc-5.5.0_musl/usr/lib -L/home/sj/Pulpit/Projekty/WITI-TRUNK/staging_dir/toolchain-mipsel_24kc_gcc-5.5.0_musl/lib -znow -zrelro -Wl,--gc-sections " make  -C /home/sj/Pulpit/Projekty/WITI-TRUNK/build_dir/target-mipsel_24kc_musl/samba-3.6.25/source3 AR="mipsel-openwrt-linux-musl-gcc-ar" AS="mipsel-openwrt-linux-musl-gcc -c -Os -pipe -mno-branch-likely -mips32r2 -mtune=24kc -fno-caller-saves -fno-plt -fhonour-copts -Wno-error=unused-but-set-variable -Wno-error=unused-result -msoft-float -iremap/home/sj/Pulpit/Projekty/WITI-TRUNK/build_dir/target-mipsel_24kc_musl/samba-3.6.25:samba-3.6.25 -Wformat -Werror=format-security -fstack-protector -D_FORTIFY_SOURCE=1 -Wl,-z,now -Wl,-z,relro -DMAX_DEBUG_LEVEL=-1 -D__location__=\\\"\\\" -ffunction-sections -fdata-sections" LD=mipsel-openwrt-linux-musl-ld NM="mipsel-openwrt-linux-musl-gcc-nm" CC="mipsel-openwrt-linux-musl-gcc" GCC="mipsel-openwrt-linux-musl-gcc" CXX="mipsel-openwrt-linux-musl-g++" RANLIB="mipsel-openwrt-linux-musl-gcc-ranlib" STRIP=mipsel-openwrt-linux-musl-strip OBJCOPY=mipsel-openwrt-linux-musl-objcopy OBJDUMP=mipsel-openwrt-linux-musl-objdump SIZE=mipsel-openwrt-linux-musl-size CROSS="mipsel-openwrt-linux-musl-" ARCH="mipsel" DYNEXP= PICFLAG= MODULES= ;
make[4]: Entering directory '/home/sj/Pulpit/Projekty/WITI-TRUNK/build_dir/target-mipsel_24kc_musl/samba-3.6.25/source3'
Using CFLAGS     = -I../lib/zlib -Os -pipe -mno-branch-likely -mips32r2 -mtune=24kc -fno-caller-saves -fno-plt -fhonour-copts -Wno-error=unused-but-set-variable -Wno-error=unused-result -msoft-float -mips16 -minterlink-mips16 -iremap/home/sj/Pulpit/Projekty/WITI-TRUNK/build_dir/target-mipsel_24kc_musl/samba-3.6.25:samba-3.6.25 -Wformat -Werror=format-security -fstack-protector -D_FORTIFY_SOURCE=1 -Wl,-z,now -Wl,-z,relro -DMAX_DEBUG_LEVEL=-1 -D__location__="" -ffunction-sections -fdata-sections -I. -I/home/sj/Pulpit/Projekty/WITI-TRUNK/build_dir/target-mipsel_24kc_musl/samba-3.6.25/source3 -I/home/sj/Pulpit/Projekty/WITI-TRUNK/build_dir/target-mipsel_24kc_musl/samba-3.6.25/source3/../lib/popt -I/home/sj/Pulpit/Projekty/WITI-TRUNK/build_dir/target-mipsel_24kc_musl/samba-3.6.25/source3/../lib/iniparser/src -Iinclude -I./include  -I. -I. -I./../lib/replace -I./librpc -I./.. -I./../lib/tevent -I../lib/tdb/include -DHAVE_CONFIG_H  -I/home/sj/Pulpit/Projekty/WITI-TRUNK/staging_dir/target-mipsel_24kc_musl/usr/include -I/home/sj/Pulpit/Projekty/WITI-TRUNK/staging_dir/target-mipsel_24kc_musl/include -I/home/sj/Pulpit/Projekty/WITI-TRUNK/staging_dir/toolchain-mipsel_24kc_gcc-5.5.0_musl/usr/include -I/home/sj/Pulpit/Projekty/WITI-TRUNK/staging_dir/toolchain-mipsel_24kc_gcc-5.5.0_musl/include/fortify -I/home/sj/Pulpit/Projekty/WITI-TRUNK/staging_dir/toolchain-mipsel_24kc_gcc-5.5.0_musl/include -Iinclude -I./include -I. -I. -I./../lib/replace -I./librpc -I./.. -I./../lib/popt  -I/home/sj/Pulpit/Projekty/WITI-TRUNK/build_dir/target-mipsel_24kc_musl/samba-3.6.25/source3/lib -I.. -D_SAMBA_BUILD_=3 -D_SAMBA_BUILD_=3
      PICFLAG    = 
      LIBS       = -lresolv -lresolv
      LDFLAGS    = -L/home/sj/Pulpit/Projekty/WITI-TRUNK/staging_dir/target-mipsel_24kc_musl/usr/lib -L/home/sj/Pulpit/Projekty/WITI-TRUNK/staging_dir/target-mipsel_24kc_musl/lib -L/home/sj/Pulpit/Projekty/WITI-TRUNK/staging_dir/toolchain-mipsel_24kc_gcc-5.5.0_musl/usr/lib -L/home/sj/Pulpit/Projekty/WITI-TRUNK/staging_dir/toolchain-mipsel_24kc_gcc-5.5.0_musl/lib -znow -zrelro -Wl,--gc-sections -L./bin
      DYNEXP     = 
      LDSHFLAGS  =  -shared -Wl,-Bsymbolic  -L/home/sj/Pulpit/Projekty/WITI-TRUNK/staging_dir/target-mipsel_24kc_musl/usr/lib -L/home/sj/Pulpit/Projekty/WITI-TRUNK/staging_dir/target-mipsel_24kc_musl/lib -L/home/sj/Pulpit/Projekty/WITI-TRUNK/staging_dir/toolchain-mipsel_24kc_gcc-5.5.0_musl/usr/lib -L/home/sj/Pulpit/Projekty/WITI-TRUNK/staging_dir/toolchain-mipsel_24kc_gcc-5.5.0_musl/lib -znow -zrelro -Wl,--gc-sections -L./bin -lc -Wl,-z,defs
      SHLIBEXT   = so
      SONAMEFLAG = -Wl,-soname=
Linking bin/samba_multicall
param/loadparm.o: In function `lp_string':
loadparm.c:(.text.lp_string+0x38): undefined reference to `_talloc_free'
param/loadparm.o: In function `free_param_opts':
loadparm.c:(.text.free_param_opts+0x20): undefined reference to `_talloc_free'
param/loadparm.o: In function `handle_netbios_aliases':
loadparm.c:(.text.handle_netbios_aliases+0xe): undefined reference to `_talloc_free'
param/loadparm.o: In function `handle_netbios_name':
loadparm.c:(.text.handle_netbios_name+0x28): undefined reference to `_talloc_free'
param/loadparm.o: In function `set_param_opt':
loadparm.c:(.text.set_param_opt+0x36): undefined reference to `_talloc_free'
param/loadparm.o:loadparm.c:(.text.store_lp_set_cmdline+0x5c): more undefined references to `_talloc_free' follow
param/loadparm.o: In function `store_lp_set_cmdline':
loadparm.c:(.text.store_lp_set_cmdline+0x6c): undefined reference to `talloc_named_const'
loadparm.c:(.text.store_lp_set_cmdline+0x78): undefined reference to `talloc_strdup'
loadparm.c:(.text.store_lp_set_cmdline+0x84): undefined reference to `talloc_strdup'
loadparm.c:(.text.store_lp_set_cmdline+0x90): undefined reference to `_talloc_free'
param/loadparm.o: In function `free_service':
loadparm.c:(.text.free_service+0x3a): undefined reference to `_talloc_free'
loadparm.c:(.text.free_service+0x5c): undefined reference to `_talloc_free'
param/loadparm.o: In function `init_copymap.isra.7':
loadparm.c:(.text.init_copymap.isra.7+0xa): undefined reference to `_talloc_free'
param/loadparm.o: In function `copy_service':
loadparm.c:(.text.copy_service+0x8e): undefined reference to `_talloc_free'
param/loadparm.o:loadparm.c:(.text.free_parameters_by_snum.constprop.19+0x2c): more undefined references to `_talloc_free' follow
param/loadparm.o: In function `canonicalize_servicename':
loadparm.c:(.text.canonicalize_servicename+0x4): undefined reference to `talloc_strdup'
param/loadparm.o: In function `getservicebyname':
loadparm.c:(.text.getservicebyname+0x44): undefined reference to `_talloc_free'
param/loadparm.o: In function `free_service_byindex':
loadparm.c:(.text.free_service_byindex+0x62): undefined reference to `_talloc_free'
param/loadparm.o: In function `add_a_service':
loadparm.c:(.text.add_a_service+0x132): undefined reference to `_talloc_free'
param/loadparm.o: In function `lp_file_list_changed':
loadparm.c:(.text.lp_file_list_changed+0x8c): undefined reference to `_talloc_free'
loadparm.c:(.text.lp_file_list_changed+0x98): undefined reference to `_talloc_free'
param/loadparm.o:loadparm.c:(.text.lp_do_parameter+0x152): more undefined references to `_talloc_free' follow
param/loadparm.o: In function `lp_set_option':
loadparm.c:(.text.lp_set_option+0x4): undefined reference to `talloc_strdup'
loadparm.c:(.text.lp_set_option+0x1a): undefined reference to `_talloc_free'
loadparm.c:(.text.lp_set_option+0x3a): undefined reference to `_talloc_free'
param/loadparm.o: In function `parse_usershare_file':
loadparm.c:(.text.parse_usershare_file+0x6c): undefined reference to `talloc_strdup'
loadparm.c:(.text.parse_usershare_file+0x96): undefined reference to `talloc_strdup'
loadparm.c:(.text.parse_usershare_file+0x128): undefined reference to `talloc_strdup'
loadparm.c:(.text.parse_usershare_file+0x138): undefined reference to `talloc_strdup'
param/loadparm.o: In function `volume_label':
loadparm.c:(.text.volume_label+0x4a): undefined reference to `talloc_strndup'
param/loadparm.o: In function `process_usershare_file':
loadparm.c:(.text.process_usershare_file+0x46): undefined reference to `talloc_asprintf'
loadparm.c:(.text.process_usershare_file+0x1e8): undefined reference to `_talloc_free'
loadparm.c:(.text.process_usershare_file+0x1f4): undefined reference to `_talloc_free'
param/loadparm.o: In function `lp_load_ex':
loadparm.c:(.text.lp_load_ex+0x114): undefined reference to `_talloc_free'
loadparm.c:(.text.lp_load_ex+0x21c): undefined reference to `_talloc_free'
loadparm.c:(.text.lp_load_ex+0x232): undefined reference to `_talloc_free'
rpc_client/cli_pipe.o:cli_pipe.c:(.text.rpc_read_send+0x4e): more undefined references to `_talloc_free' follow
rpc_client/cli_pipe.o: In function `rpc_read_done':
cli_pipe.c:(.text.rpc_read_done+0xe): undefined reference to `_talloc_get_type_abort'
cli_pipe.c:(.text.rpc_read_done+0x20): undefined reference to `_talloc_get_type_abort'
cli_pipe.c:(.text.rpc_read_done+0x40): undefined reference to `_talloc_free'
rpc_client/cli_pipe.o: In function `rpc_api_pipe_auth3_done':
cli_pipe.c:(.text.rpc_api_pipe_auth3_done+0xc): undefined reference to `_talloc_get_type_abort'
cli_pipe.c:(.text.rpc_api_pipe_auth3_done+0x22): undefined reference to `_talloc_free'
rpc_client/cli_pipe.o: In function `cli_api_pipe_read_done':
cli_pipe.c:(.text.cli_api_pipe_read_done+0xc): undefined reference to `_talloc_get_type_abort'
cli_pipe.c:(.text.cli_api_pipe_read_done+0x1e): undefined reference to `_talloc_get_type_abort'
cli_pipe.c:(.text.cli_api_pipe_read_done+0x3c): undefined reference to `_talloc_free'
rpc_client/cli_pipe.o: In function `cli_api_pipe_trans_done':
cli_pipe.c:(.text.cli_api_pipe_trans_done+0xc): undefined reference to `_talloc_get_type_abort'
cli_pipe.c:(.text.cli_api_pipe_trans_done+0x1e): undefined reference to `_talloc_get_type_abort'
cli_pipe.c:(.text.cli_api_pipe_trans_done+0x44): undefined reference to `_talloc_free'
rpc_client/cli_pipe.o: In function `rpc_write_done':
cli_pipe.c:(.text.rpc_write_done+0xe): undefined reference to `_talloc_get_type_abort'
cli_pipe.c:(.text.rpc_write_done+0x20): undefined reference to `_talloc_get_type_abort'
cli_pipe.c:(.text.rpc_write_done+0x40): undefined reference to `_talloc_free'
rpc_client/cli_pipe.o: In function `rpc_api_pipe_got_pdu':
cli_pipe.c:(.text.rpc_api_pipe_got_pdu+0xc): undefined reference to `_talloc_get_type_abort'
cli_pipe.c:(.text.rpc_api_pipe_got_pdu+0x1e): undefined reference to `_talloc_get_type_abort'
cli_pipe.c:(.text.rpc_api_pipe_got_pdu+0x38): undefined reference to `_talloc_free'
cli_pipe.c:(.text.rpc_api_pipe_got_pdu+0x4c): undefined reference to `talloc_named_const'
cli_pipe.c:(.text.rpc_api_pipe_got_pdu+0x60): undefined reference to `_talloc_free'
cli_pipe.c:(.text.rpc_api_pipe_got_pdu+0x9c): undefined reference to `_talloc_free'
cli_pipe.c:(.text.rpc_api_pipe_got_pdu+0x1d6): undefined reference to `_talloc_free'
cli_pipe.c:(.text.rpc_api_pipe_got_pdu+0x1fe): undefined reference to `_talloc_free'
cli_pipe.c:(.text.rpc_api_pipe_got_pdu+0x236): undefined reference to `_talloc_free'
rpc_client/cli_pipe.o:cli_pipe.c:(.text.rpc_api_pipe_got_pdu+0x258): more undefined references to `_talloc_free' follow
(...)
tevent_req.c:(.text.tevent_req_set_endtime+0xc): undefined reference to `_talloc_free'
./bin/libtevent.a(tevent_queue.o):tevent_queue.c:(.text.tevent_queue_destructor+0xe): more undefined references to `_talloc_free' follow
./bin/libtevent.a(tevent_queue.o): In function `tevent_queue_immediate_trigger':
tevent_queue.c:(.text.tevent_queue_immediate_trigger+0x4): undefined reference to `talloc_check_name'
./bin/libtevent.a(tevent_queue.o): In function `_tevent_queue_create':
tevent_queue.c:(.text._tevent_queue_create+0x8): undefined reference to `_talloc_zero'
tevent_queue.c:(.text._tevent_queue_create+0x14): undefined reference to `talloc_strdup'
tevent_queue.c:(.text._tevent_queue_create+0x30): undefined reference to `_talloc_free'
tevent_queue.c:(.text._tevent_queue_create+0x42): undefined reference to `_talloc_set_destructor'
./bin/libtevent.a(tevent_queue.o): In function `tevent_queue_add':
tevent_queue.c:(.text.tevent_queue_add+0xc): undefined reference to `_talloc_zero'
tevent_queue.c:(.text.tevent_queue_add+0x56): undefined reference to `_talloc_set_destructor'
./bin/libtevent.a(tevent_standard.o): In function `epoll_fallback_to_select':
tevent_standard.c:(.text.epoll_fallback_to_select+0x2e): undefined reference to `_talloc_set_destructor'
./bin/libtevent.a(tevent_standard.o): In function `std_event_loop_once':
tevent_standard.c:(.text.std_event_loop_once+0x6): undefined reference to `talloc_check_name'
tevent_standard.c:(.text.std_event_loop_once+0x112): undefined reference to `talloc_check_name'
./bin/libtevent.a(tevent_standard.o): In function `std_event_add_fd':
tevent_standard.c:(.text.std_event_add_fd+0xe): undefined reference to `talloc_check_name'
tevent_standard.c:(.text.std_event_add_fd+0x4c): undefined reference to `_talloc_set_destructor'
./bin/libtevent.a(tevent_standard.o): In function `std_event_fd_destructor':
tevent_standard.c:(.text.std_event_fd_destructor+0xa): undefined reference to `talloc_check_name'
./bin/libtevent.a(tevent_standard.o): In function `std_event_set_fd_flags':
tevent_standard.c:(.text.std_event_set_fd_flags+0x16): undefined reference to `talloc_check_name'
./bin/libtevent.a(tevent_standard.o): In function `std_event_context_init':
tevent_standard.c:(.text.std_event_context_init+0x6): undefined reference to `_talloc_zero'
tevent_standard.c:(.text.std_event_context_init+0x28): undefined reference to `_talloc_set_destructor'
./bin/libtevent.a(tevent_select.o): In function `select_event_loop_once':
tevent_select.c:(.text.select_event_loop_once+0x6): undefined reference to `talloc_check_name'
./bin/libtevent.a(tevent_select.o): In function `select_event_fd_destructor':
tevent_select.c:(.text.select_event_fd_destructor+0xa): undefined reference to `talloc_check_name'
./bin/libtevent.a(tevent_select.o): In function `select_event_context_init':
tevent_select.c:(.text.select_event_context_init+0x6): undefined reference to `_talloc_zero'
./bin/libtevent.a(tevent_select.o): In function `select_event_add_fd':
tevent_select.c:(.text.select_event_add_fd+0xe): undefined reference to `talloc_check_name'
tevent_select.c:(.text.select_event_add_fd+0x5a): undefined reference to `_talloc_set_destructor'
./bin/libtevent.a(tevent_poll.o): In function `poll_event_set_fd_flags':
tevent_poll.c:(.text.poll_event_set_fd_flags+0xe): undefined reference to `_talloc_get_type_abort'
./bin/libtevent.a(tevent_poll.o): In function `poll_event_add_fd':
tevent_poll.c:(.text.poll_event_add_fd+0x10): undefined reference to `_talloc_get_type_abort'
tevent_poll.c:(.text.poll_event_add_fd+0x38): undefined reference to `talloc_get_size'
tevent_poll.c:(.text.poll_event_add_fd+0x56): undefined reference to `_talloc_realloc_array'
tevent_poll.c:(.text.poll_event_add_fd+0x6c): undefined reference to `_talloc_realloc_array'
tevent_poll.c:(.text.poll_event_add_fd+0x76): undefined reference to `_talloc_free'
tevent_poll.c:(.text.poll_event_add_fd+0xca): undefined reference to `_talloc_set_destructor'
./bin/libtevent.a(tevent_poll.o): In function `poll_event_fd_destructor':
tevent_poll.c:(.text.poll_event_fd_destructor+0x12): undefined reference to `_talloc_get_type_abort'
./bin/libtevent.a(tevent_poll.o): In function `poll_event_context_init':
tevent_poll.c:(.text.poll_event_context_init+0x6): undefined reference to `_talloc_zero'
./bin/libtevent.a(tevent_poll.o): In function `poll_event_loop_once':
tevent_poll.c:(.text.poll_event_loop_once+0x3c): undefined reference to `_talloc_get_type_abort'
./bin/libtevent.a(tevent_epoll.o): In function `epoll_event_loop_once':
tevent_epoll.c:(.text.epoll_event_loop_once+0x6): undefined reference to `talloc_check_name'
tevent_epoll.c:(.text.epoll_event_loop_once+0x110): undefined reference to `talloc_check_name'
./bin/libtevent.a(tevent_epoll.o): In function `epoll_event_add_fd':
tevent_epoll.c:(.text.epoll_event_add_fd+0xe): undefined reference to `talloc_check_name'
tevent_epoll.c:(.text.epoll_event_add_fd+0x3e): undefined reference to `_talloc_set_destructor'
./bin/libtevent.a(tevent_epoll.o): In function `epoll_event_fd_destructor':
tevent_epoll.c:(.text.epoll_event_fd_destructor+0xa): undefined reference to `talloc_check_name'
./bin/libtevent.a(tevent_epoll.o): In function `epoll_event_set_fd_flags':
tevent_epoll.c:(.text.epoll_event_set_fd_flags+0x16): undefined reference to `talloc_check_name'
./bin/libtevent.a(tevent_epoll.o): In function `epoll_event_context_init':
tevent_epoll.c:(.text.epoll_event_context_init+0x8): undefined reference to `_talloc_zero'
tevent_epoll.c:(.text.epoll_event_context_init+0x2a): undefined reference to `_talloc_set_destructor'
tevent_epoll.c:(.text.epoll_event_context_init+0x40): undefined reference to `_talloc_free'
collect2: error: ld returned 1 exit status
Makefile:1831: recipe for target 'bin/samba_multicall' failed
make[4]: *** [bin/samba_multicall] Error 1
make[4]: Leaving directory '/home/sj/Pulpit/Projekty/WITI-TRUNK/build_dir/target-mipsel_24kc_musl/samba-3.6.25/source3'
Makefile:172: recipe for target '/home/sj/Pulpit/Projekty/WITI-TRUNK/build_dir/target-mipsel_24kc_musl/samba-3.6.25/.built' failed
make[3]: *** [/home/sj/Pulpit/Projekty/WITI-TRUNK/build_dir/target-mipsel_24kc_musl/samba-3.6.25/.built] Error 2
make[3]: Leaving directory '/home/sj/Pulpit/Projekty/WITI-TRUNK/package/network/services/samba36'
package/Makefile:106: recipe for target 'package/network/services/samba36/compile' failed
make[2]: *** [package/network/services/samba36/compile] Error 2
make[2]: Leaving directory '/home/sj/Pulpit/Projekty/WITI-TRUNK'
package/Makefile:102: recipe for target '/home/sj/Pulpit/Projekty/WITI-TRUNK/staging_dir/target-mipsel_24kc_musl/stamp/.package_compile' failed
make[1]: *** [/home/sj/Pulpit/Projekty/WITI-TRUNK/staging_dir/target-mipsel_24kc_musl/stamp/.package_compile] Error 2
make[1]: Leaving directory '/home/sj/Pulpit/Projekty/WITI-TRUNK'
/home/sj/Pulpit/Projekty/WITI-TRUNK/include/toplevel.mk:216: polecenia dla obiektu 'world' nie powiodły się
make: *** [world] Błąd 2


Closed by  Hans Dedecker
24.02.2018 20:13
Reason for closing:  Fixed
Additional comments about closing:  

Fixed by commit https://git.o penwrt.org/?p=openwrt/openwrt.git;a=comm it;h=316eb26a3a8e4cf84074baa6bbe0d6f905c 22941

build000 commented on 05.02.2018 17:21

My config

   .config (218.5 KiB)
build000 commented on 24.02.2018 17:37

Loading...

Available keyboard shortcuts

Tasklist

Task Details

Task Editing